Target
Muscarinic acetylcholine receptor M1
Ligand
BDBM48918
Substrate
Meas. Tech.
ChEMBL_138684 (CHEMBL748216)
EC50
400±n/a nM
Citation
 Pei, XFGupta, THBadio, BPadgett, WLDaly, JW 6beta-Acetoxynortropane: a potent muscarinic agonist with apparent selectivity toward M2-receptors. J Med Chem 41:2047-55 (1998)  
Target
Name:
Muscarinic acetylcholine receptor M1
Synonyms:
ACM1_RAT Chrm-1 cholinergic receptor, muscarinic 1
Type:
Enzyme Catalytic Domain
Mol. Mass.:
51390.46
Organism:
RAT
Description:
P08482
Residue:
460
  
Inhibitor
Name:
BDBM48918
Synonyms:
2-acetoxypropyl(trimethyl)ammonium;chloride 2-acetyloxypropyl(trimethyl)azanium;chloride METHACHOLINE CHLORIDE SMR000059224 | cid_6114
Type:
Small organic molecule
Emp. Form.:
C8H18NO2
Mol. Mass.:
160.2335
SMILES:
CC(C[N+](C)(C)C)OC(C)=O
: