Target
Maltase-glucoamylase
Ligand
BDBM50065255
Substrate
Meas. Tech.
ChEMBL_34564 (CHEMBL649328)
Ki
6900±n/a nM
Citation
 Asano, NNishida, MKato, AKizu, HMatsui, KShimada, YItoh, TBaba, MWatson, AANash, RJLilley, PMWatkin, DJFleet, GW Homonojirimycin isomers and N-alkylated homonojirimycins: structural and conformational basis of inhibition of glycosidases. J Med Chem 41:2565-71 (1998)  
Target
Name:
Maltase-glucoamylase
Synonyms:
Alpha glucosidase MGA MGAML Maltase | Maltase-glucoamylase, intestinal
Type:
Enzyme
Mol. Mass.:
209817.06
Organism:
Homo sapiens (Human)
Description:
O43451
Residue:
1857
  
Inhibitor
Name:
BDBM50065255
Synonyms:
(R)-2,6-Bis-hydroxymethyl-piperidine-3,4,5-triol | CHEMBL87169
Type:
Small organic molecule
Emp. Form.:
C7H15NO5
Mol. Mass.:
193.1977
SMILES:
OCC1NC(CO)[C@@H](O)C(O)C1O
: