Target
Sodium-dependent dopamine transporter
Ligand
BDBM50068479
Substrate
Meas. Tech.
ChEMBL_62340 (CHEMBL674432)
Ki
4.2±n/a nM
Citation
 Kozikowski, APAraldi, GLPrakash, KRZhang, MJohnson, KM Synthesis and biological properties of new 2beta-alkyl- and 2beta-aryl-3-(substituted phenyl)tropane derivatives: stereochemical effect of C-3 on affinity and selectivity for neuronal dopamine and serotonin transporters. J Med Chem 41:4973-82 (1999)  
Target
Name:
Sodium-dependent dopamine transporter
Synonyms:
DA transporter SC6A3_RAT Sodium-dependent dopamine transporter | Sodium-dependent dopamine transporter (DAT)
Type:
Multi-pass membrane protein
Mol. Mass.:
68749.45
Organism:
Rattus norvegicus (rat)
Description:
P23977
Residue:
619
  
Inhibitor
Name:
BDBM50068479
Synonyms:
(2S,3R,5R)-8-Methyl-2-phenyl-3-p-tolyl-8-aza-bicyclo[3.2.1]octane | CHEMBL421777
Type:
Small organic molecule
Emp. Form.:
C21H25N
Mol. Mass.:
291.4299
SMILES:
CN1[C@@H]2CCC1[C@@H]([C@@H](C2)c1ccc(C)cc1)c1ccccc1
: