Target
Sodium-dependent serotonin transporter
Ligand
BDBM50068473
Substrate
Meas. Tech.
ChEMBL_201817 (CHEMBL805325)
Ki
22±n/a nM
Citation
 Kozikowski, APAraldi, GLPrakash, KRZhang, MJohnson, KM Synthesis and biological properties of new 2beta-alkyl- and 2beta-aryl-3-(substituted phenyl)tropane derivatives: stereochemical effect of C-3 on affinity and selectivity for neuronal dopamine and serotonin transporters. J Med Chem 41:4973-82 (1999)  
Target
Name:
Sodium-dependent serotonin transporter
Synonyms:
5-HT Transporter 5HT transporter Anandamid membrane transporter, AMT Monoamine transporters; Norepinephrine & serotonin Slc6a4 Sodium-dependent serotonin transporter (SERT) | imipramine receptor
Type:
Multi-pass membrane protein
Mol. Mass.:
70168.43
Organism:
Rattus norvegicus (rat)
Description:
P31652
Residue:
630
  
Inhibitor
Name:
BDBM50068473
Synonyms:
(2S,8S)-3-(4-Fluoro-phenyl)-8-methyl-2-propyl-8-aza-bicyclo[3.2.1]octane
Type:
Small organic molecule
Emp. Form.:
C17H24FN
Mol. Mass.:
261.3776
SMILES:
CCC[C@@H]1C2CCC(CC1c1ccc(F)cc1)N2C
: