Target
Methylated-DNA--protein-cysteine methyltransferase
Ligand
BDBM50068789
Substrate
Meas. Tech.
ChEMBL_144712 (CHEMBL751007)
IC50
90±n/a nM
Citation
 McElhinney, RSDonnelly, DJMcCormick, JEKelly, JWatson, AJRafferty, JAElder, RHMiddleton, MRWillington, MAMcMurry, TBMargison, GP Inactivation of O6-alkylguanine-DNA alkyltransferase. 1. Novel O6-(hetarylmethyl)guanines having basic rings in the side chain. J Med Chem 41:5265-71 (1999)  
Target
Name:
Methylated-DNA--protein-cysteine methyltransferase
Synonyms:
6-O-methylguanine-DNA methyltransferase MGMT_HUMAN
Type:
PROTEIN
Mol. Mass.:
21651.27
Organism:
Homo sapiens (Human)
Description:
ChEMBL_144711
Residue:
207
  
Inhibitor
Name:
BDBM50068789
Synonyms:
6-([1,3]Dioxolo[4,5-b]pyridin-6-ylmethoxy)-6,9-dihydro-1H-purin-2-ylamine | CHEMBL150918
Type:
Small organic molecule
Emp. Form.:
C12H12N6O3
Mol. Mass.:
288.2621
SMILES:
NC1=Nc2nc[nH]c2C(N1)OCc1cnc2OCOc2c1
: