Target
Steryl-sulfatase
Ligand
BDBM50134329
Substrate
Meas. Tech.
ChEMBL_203034 (CHEMBL812968)
IC50
5.6±n/a nM
Citation
 Ciobanu, LCBoivin, RPLuu-The, VLabrie, FPoirier, D Potent inhibition of steroid sulfatase activity by 3-O-sulfamate 17alpha-benzyl(or 4'-tert-butylbenzyl)estra-1,3,5(10)-trienes: combination of two substituents at positions C3 and c17alpha of estradiol. J Med Chem 42:2280-6 (1999)  
Target
Name:
Steryl-sulfatase
Synonyms:
ARSC1 Arylsulfatase C STS_HUMAN Steryl-sulfate sulfohydrolase
Type:
Enzyme
Mol. Mass.:
65503.66
Organism:
Homo sapiens (Human)
Description:
P08842
Residue:
583
  
Inhibitor
Name:
BDBM50134329
Synonyms:
CHEMBL122708 Sulfamic acid (8R,9S,13S,14S)-13-methyl-17-oxo-7,8,9,11,12,13,14,15,16,17-decahydro-6H-cyclopenta[a]phenanthren-3-yl ester estrone3-O-sulfamate
Type:
Small organic molecule
Emp. Form.:
C18H23NO4S
Mol. Mass.:
349.445
SMILES:
C[C@]12CC[C@H]3[C@@H](CCc4cc(OS(N)(=O)=O)ccc34)[C@@H]1CCC2=O
: