Target
Stromelysin-1
Ligand
BDBM50082537
Substrate
Meas. Tech.
ChEMBL_104579 (CHEMBL715159)
IC50
0.70±n/a nM
Citation
 Almstead, NGBradley, RSPikul, SDe, BNatchus, MGTaiwo, YOGu, FWilliams, LEHynd, BAJanusz, MJDunaway, CMMieling, GE Design, synthesis, and biological evaluation of potent thiazine- and thiazepine-based matrix metalloproteinase inhibitors. J Med Chem 42:4547-62 (1999)  
Target
Name:
Stromelysin-1
Synonyms:
MMP-3 MMP3_HUMAN Matrix metalloproteinase 3 Matrix metalloproteinase-3 (MMP-3) SL-1 Stromelysin 1 | Transin-1
Type:
Enzyme
Mol. Mass.:
53973.13
Organism:
Homo sapiens (Human)
Description:
P08254
Residue:
477
  
Inhibitor
Name:
BDBM50082537
Synonyms:
(S)-4-(4-Methoxy-benzenesulfonyl)-2,2-dimethyl-thiomorpholine-3-carboxylic acid hydroxyamide | CHEMBL141080
Type:
Small organic molecule
Emp. Form.:
C14H20N2O5S2
Mol. Mass.:
360.449
SMILES:
COc1ccc(cc1)S(=O)(=O)N1CCSC(C)(C)[C@@H]1C(=O)NO
: