Target
Stromelysin-1
Ligand
BDBM50082542
Substrate
Meas. Tech.
ChEMBL_104579 (CHEMBL715159)
IC50
0.70±n/a nM
Citation
 Almstead, NGBradley, RSPikul, SDe, BNatchus, MGTaiwo, YOGu, FWilliams, LEHynd, BAJanusz, MJDunaway, CMMieling, GE Design, synthesis, and biological evaluation of potent thiazine- and thiazepine-based matrix metalloproteinase inhibitors. J Med Chem 42:4547-62 (1999)  
Target
Name:
Stromelysin-1
Synonyms:
MMP-3 MMP3_HUMAN Matrix metalloproteinase 3 Matrix metalloproteinase-3 (MMP-3) SL-1 Stromelysin 1 | Transin-1
Type:
Enzyme
Mol. Mass.:
53973.13
Organism:
Homo sapiens (Human)
Description:
P08254
Residue:
477
  
Inhibitor
Name:
BDBM50082542
Synonyms:
(S)-7-(4-Methoxy-benzenesulfonyl)-5,5-dimethyl-[1,4,7]oxathiazonane-6-carboxylic acid hydroxyamide | CHEMBL342172
Type:
Small organic molecule
Emp. Form.:
C16H24N2O6S2
Mol. Mass.:
404.502
SMILES:
COc1ccc(cc1)S(=O)(=O)N1CCOCCSC(C)(C)[C@@H]1C(=O)NO
: