Target
Alpha-1A adrenergic receptor
Ligand
BDBM50082825
Substrate
Meas. Tech.
ChEMBL_33605 (CHEMBL876765)
Ki
0.10±n/a nM
Citation
 Wong, WCSun, WLagu, BTian, DMarzabadi, MRZhang, FNagarathnam, DMiao, SWWetzel, JMPeng, JForray, CChang, RSChen, TBRansom, RO'Malley, SBroten, TPKling, PVyas, KPZhang, KGluchowski, C Design and synthesis of novel alpha(1)(a) adrenoceptor-selective antagonists. 4. Structure-activity relationship in the dihydropyrimidine series. J Med Chem 42:4804-13 (1999)  
Target
Name:
Alpha-1A adrenergic receptor
Synonyms:
ADA1A_HUMAN ADRA1C Alpha 1A-adrenoceptor Alpha adrenergic receptor 1a Alpha-adrenergic receptor 1c adrenergic Alpha1 | adrenergic Alpha1C
Type:
Cell-surface receptors
Mol. Mass.:
51511.67
Organism:
Homo sapiens (Human)
Description:
P35348
Residue:
466
  
Inhibitor
Name:
BDBM50082825
Synonyms:
4-(3,4-Difluoro-phenyl)-3-[5-(4-methoxycarbonyl-4-phenyl-piperidin-1-yl)-pentyl]-6-methyl-2-oxo-1,2,3,4-tetrahydro-pyrimidine-5-carboxylic acid methyl ester | CHEMBL142981
Type:
Small organic molecule
Emp. Form.:
C31H37F2N3O5
Mol. Mass.:
569.6394
SMILES:
COC(=O)C1C(N(CCCCCN2CCC(CC2)(C(=O)OC)c2ccccc2)C(=O)N=C1C)c1ccc(F)c(F)c1
: