Target
Adenosine receptor A3
Ligand
BDBM25400
Substrate
Meas. Tech.
ChEMBL_32008 (CHEMBL646605)
Ki
120±n/a nM
Citation
 van Tilburg, EWvon Frijtag Drabbe Künzel, Jde Groote, MVollinga, RCLorenzen, AIJzerman, AP N6,5'-Disubstituted adenosine derivatives as partial agonists for the human adenosine A3 receptor. J Med Chem 42:1393-400 (1999)  
Target
Name:
Adenosine receptor A3
Synonyms:
A3 adenosine receptor (hA3) ADORA3 | Adenosine A3 receptor (A3AR)
Type:
G Protein-Coupled Receptor (GPCR)
Mol. Mass.:
36197.32
Organism:
Homo sapiens (Human)
Description:
P0DMS8
Residue:
318
  
Inhibitor
Name:
BDBM25400
Synonyms:
(2R,3R,4S,5R)-2-[6-(cyclopentylamino)-9H-purin-9-yl]-5-(hydroxymethyl)oxolane-3,4-diol CPA N6-cyclopentyladenosine (CPA) | cid_657378
Type:
Small organic molecule
Emp. Form.:
C15H21N5O4
Mol. Mass.:
335.3583
SMILES:
OC[C@H]1O[C@H]([C@H](O)[C@@H]1O)n1cnc2c(NC3CCCC3)ncnc12
: