Target
Adenosine receptor A1
Ligand
BDBM50088420
Substrate
Meas. Tech.
ChEMBL_29487 (CHEMBL641721)
Ki
25900±n/a nM
Citation
 Jacobson, KAJi, XLi, AHMelman, NSiddiqui, MAShin, KJMarquez, VERavi, RG Methanocarba analogues of purine nucleosides as potent and selective adenosine receptor agonists. J Med Chem 43:2196-203 (2000)  
Target
Name:
Adenosine receptor A1
Synonyms:
AA1R_RAT ADENOSINE A1 high Adenosine A1 receptor (A1) Adenosine receptors A1 | Adora1
Type:
Protein
Mol. Mass.:
36704.13
Organism:
Rattus norvegicus (rat)
Description:
Residue:
326
  
Inhibitor
Name:
BDBM50088420
Synonyms:
3-Hydroxymethyl-5-[6-(3-iodo-benzylamino)-purin-9-yl]-cyclopentane-1,2-diol | CHEMBL71385
Type:
Small organic molecule
Emp. Form.:
C18H20IN5O3
Mol. Mass.:
481.2876
SMILES:
OC[C@H]1C[C@H]([C@H](O)[C@@H]1O)n1cnc2c(NCc3cccc(I)c3)ncnc12
: