Target
Adenosine receptor A2a
Ligand
BDBM50088426
Substrate
Meas. Tech.
ChEMBL_30025 (CHEMBL641316)
Ki
2150±n/a nM
Citation
 Jacobson, KAJi, XLi, AHMelman, NSiddiqui, MAShin, KJMarquez, VERavi, RG Methanocarba analogues of purine nucleosides as potent and selective adenosine receptor agonists. J Med Chem 43:2196-203 (2000)  
Target
Name:
Adenosine receptor A2a
Synonyms:
AA2AR_RAT Adenosine A2 receptor Adenosine Receptors A2a (A2a) Adenosine receptors A2a Rat striatal adenosine A2a receptor
Type:
G Protein-Coupled Receptor (GPCR)
Mol. Mass.:
45015.65
Organism:
Rattus norvegicus (rat)
Description:
Rat A2A receptors expressed in CHO cells.
Residue:
410
  
Inhibitor
Name:
BDBM50088426
Synonyms:
(1R,2S,3R,5R)-3-(6-amino-9H-purin-9-yl)-5-(hydroxymethyl)cyclopentane-1,2-diol CHEMBL49935
Type:
Small organic molecule
Emp. Form.:
C11H15N5O3
Mol. Mass.:
265.2685
SMILES:
Nc1ncnc2n(cnc12)[C@@H]1C[C@H](CO)[C@@H](O)[C@H]1O
: