Target
Adenosine receptor A2a
Ligand
BDBM50088425
Substrate
Meas. Tech.
ChEMBL_30025 (CHEMBL641316)
Ki
601±n/a nM
Citation
 Jacobson, KAJi, XLi, AHMelman, NSiddiqui, MAShin, KJMarquez, VERavi, RG Methanocarba analogues of purine nucleosides as potent and selective adenosine receptor agonists. J Med Chem 43:2196-203 (2000)  
Target
Name:
Adenosine receptor A2a
Synonyms:
AA2AR_RAT Adenosine A2 receptor Adenosine Receptors A2a (A2a) Adenosine receptors A2a Rat striatal adenosine A2a receptor
Type:
G Protein-Coupled Receptor (GPCR)
Mol. Mass.:
45015.65
Organism:
Rattus norvegicus (rat)
Description:
Rat A2A receptors expressed in CHO cells.
Residue:
410
  
Inhibitor
Name:
BDBM50088425
Synonyms:
(1R,2R,3S,4R,5S)-1-Hydroxymethyl-4-[6-(3-iodo-benzylamino)-purin-9-yl]-bicyclo[3.1.0]hexane-2,3-diol 1-hydroxymethyl-4-[6-(3-iodobenzylamino)-9H-9-purinyl]-(1R,2R,3S,4R,5S)-bicyclo[3.1.0]hexane-2,3-diol | CHEMBL417292
Type:
Small organic molecule
Emp. Form.:
C19H20IN5O3
Mol. Mass.:
493.2983
SMILES:
OC[C@@]12C[C@@H]1[C@H]([C@H](O)[C@@H]2O)n1cnc2c(NCc3cccc(I)c3)ncnc12
: