Target
Phosphodiesterase
Ligand
BDBM15296
Substrate
Meas. Tech.
ChEMBL_156624 (CHEMBL759869)
IC50
843±n/a nM
Citation
 Watanabe, NAdachi, HTakase, YOzaki, HMatsukura, MMiyazaki, KIshibashi, KIshihara, HKodama, KNishino, MKakiki, MKabasawa, Y 4-(3-Chloro-4-methoxybenzyl)aminophthalazines: synthesis and inhibitory activity toward phosphodiesterase 5. J Med Chem 43:2523-9 (2000)  
Target
Name:
Phosphodiesterase
Synonyms:
Phosphodiesterase 3A
Type:
PROTEIN
Mol. Mass.:
108833.33
Organism:
Sus scrofa
Description:
ChEMBL_155977
Residue:
985
  
Inhibitor
Name:
BDBM15296
Synonyms:
6-methyl-2-oxo-5-(pyridin-4-yl)-1,2-dihydropyridine-3-carbonitrile CHEMBL189 Primacor US9249139, Milrinone
Type:
Small organic molecule
Emp. Form.:
C12H9N3O
Mol. Mass.:
211.2194
SMILES:
Cc1[nH]c(=O)c(cc1-c1ccncc1)C#N
: