Target
Metabotropic glutamate receptor 6
Ligand
BDBM50089906
Substrate
Meas. Tech.
ChEMBL_104311 (CHEMBL718130)
Ki
5300±n/a nM
Citation
 Bräuner-Osborne, HEgebjerg, JNielsen, EOMadsen, UKrogsgaard-Larsen, P Ligands for glutamate receptors: design and therapeutic prospects. J Med Chem 43:2609-45 (2000)  
Target
Name:
Metabotropic glutamate receptor 6
Synonyms:
GPRC1F GRM6_HUMAN Metabotropic glutamate receptor 6 metabotropic glutamate 6
Type:
Enzyme Catalytic Domain
Mol. Mass.:
95479.26
Organism:
Homo sapiens (Human)
Description:
metabotropic glutamate 6 GRM6 HUMAN::O15303
Residue:
877
  
Inhibitor
Name:
BDBM50089906
Synonyms:
2-Amino-bicyclo[2.1.1]hexane-2,5-dicarboxylic acid(ABHxD-I) | CHEMBL90501
Type:
Small organic molecule
Emp. Form.:
C8H11NO4
Mol. Mass.:
185.1772
SMILES:
N[C@]1(CC2CC1[C@H]2C(O)=O)C(O)=O
: