Target
Metabotropic glutamate receptor 1
Ligand
BDBM50089906
Substrate
Meas. Tech.
ChEMBL_105708 (CHEMBL719076)
Ki
1600±n/a nM
Citation
 Bräuner-Osborne, HEgebjerg, JNielsen, EOMadsen, UKrogsgaard-Larsen, P Ligands for glutamate receptors: design and therapeutic prospects. J Med Chem 43:2609-45 (2000)  
Target
Name:
Metabotropic glutamate receptor 1
Synonyms:
GPRC1A GRM1_HUMAN Metabotropic Glutamate 1a | metabotropic glutamate 1
Type:
Enzyme
Mol. Mass.:
132358.19
Organism:
Homo sapiens (Human)
Description:
Q13255
Residue:
1194
  
Inhibitor
Name:
BDBM50089906
Synonyms:
2-Amino-bicyclo[2.1.1]hexane-2,5-dicarboxylic acid(ABHxD-I) | CHEMBL90501
Type:
Small organic molecule
Emp. Form.:
C8H11NO4
Mol. Mass.:
185.1772
SMILES:
N[C@]1(CC2CC1[C@H]2C(O)=O)C(O)=O
: