Target
Gag-Pol polyprotein [489-587]
Ligand
BDBM519
Substrate
Meas. Tech.
ChEMBL_222918 (CHEMBL842692)
Ki
117±n/a nM
Citation
 Dorsey, BDMcDonough, CMcDaniel, SLLevin, RBNewton, CLHoffman, JMDarke, PLZugay-Murphy, JAEmini, EASchleif, WAOlsen, DBStahlhut, MWRutkowski, CAKuo, LCLin, JHChen, IWMichelson, SRHolloway, MKHuff, JRVacca, JP Identification of MK-944a: a second clinical candidate from the hydroxylaminepentanamide isostere series of HIV protease inhibitors. J Med Chem 43:3386-99 (2000)  
Target
Name:
Gag-Pol polyprotein [489-587]
Synonyms:
Human immunodeficiency virus type 1 protease Pol polyprotein | gag-pol
Type:
Enzyme Subunit
Mol. Mass.:
10781.16
Organism:
Human immunodeficiency virus type 1
Description:
P04585[489-587]
Residue:
99
  
Inhibitor
Name:
BDBM519
Synonyms:
(2S)-N-[(2S,3R)-4-[(3S,4aS,8aS)-3-(tert-butylcarbamoyl)-decahydroisoquinolin-2-yl]-3-hydroxy-1-phenylbutan-2-yl]-2-(quinolin-2-ylformamido)butanediamide Fortovase Ro 31-8959 Saquinavir
Type:
Small organic molecule
Emp. Form.:
C38H50N6O5
Mol. Mass.:
670.8408
SMILES:
CC(C)(C)NC(=O)[C@@H]1C[C@@H]2CCCC[C@@H]2CN1C[C@@H](O)[C@H](Cc1ccccc1)NC(=O)[C@H](CC(N)=O)NC(=O)c1ccc2ccccc2n1
: