Target
Gag-Pol polyprotein [489-587]
Ligand
BDBM517
Substrate
Meas. Tech.
ChEMBL_159326 (CHEMBL769379)
IC50
0.59±n/a nM
Citation
 Dorsey, BDMcDonough, CMcDaniel, SLLevin, RBNewton, CLHoffman, JMDarke, PLZugay-Murphy, JAEmini, EASchleif, WAOlsen, DBStahlhut, MWRutkowski, CAKuo, LCLin, JHChen, IWMichelson, SRHolloway, MKHuff, JRVacca, JP Identification of MK-944a: a second clinical candidate from the hydroxylaminepentanamide isostere series of HIV protease inhibitors. J Med Chem 43:3386-99 (2000)  
Target
Name:
Gag-Pol polyprotein [489-587]
Synonyms:
Human immunodeficiency virus type 1 protease Pol polyprotein | gag-pol
Type:
Enzyme Subunit
Mol. Mass.:
10781.16
Organism:
Human immunodeficiency virus type 1
Description:
P04585[489-587]
Residue:
99
  
Inhibitor
Name:
BDBM517
Synonyms:
(2S)-1-[(2S,4R)-4-benzyl-2-hydroxy-4-{[(1S,2R)-2-hydroxy-2,3-dihydro-1H-inden-1-yl]carbamoyl}butyl]-N-tert-butyl-4-(pyridin-3-ylmethyl)piperazine-2-carboxamide Crixivan Indinavir L-735, 524 | MK639
Type:
Small organic molecule
Emp. Form.:
C36H47N5O4
Mol. Mass.:
613.7895
SMILES:
CC(C)(C)NC(=O)[C@@H]1CN(Cc2cccnc2)CCN1C[C@@H](O)C[C@@H](Cc1ccccc1)C(=O)N[C@@H]1[C@H](O)Cc2ccccc12
: