Target
D(2) dopamine receptor
Ligand
BDBM50092173
Substrate
Meas. Tech.
ChEMBL_61788 (CHEMBL670542)
EC50
5.7±n/a nM
Citation
 van Vliet, LARodenhuis, NWikström, HPugsley, TASerpa, KAMeltzer, LTHeffner, TGWise, LDLajiness, MEHuff, RMSvensson, KHaenen, GRBast, A Thiazoloindans and thiazolobenzopyrans: a novel class of orally active central dopamine (partial) agonists. J Med Chem 43:3549-57 (2000)  
Target
Name:
D(2) dopamine receptor
Synonyms:
DOPAMINE D2 DOPAMINE D2 Short Dopamine D2 receptor Drd2
Type:
G Protein-Coupled Receptor (GPCR)
Mol. Mass.:
50931.60
Organism:
Rattus norvegicus (rat)
Description:
P61169
Residue:
444
  
Inhibitor
Name:
BDBM50092173
Synonyms:
CHEMBL325710 | N*6*,N*6*-Dipropyl-6,7-dihydro-5H-1-thia-3-aza-s-indacene-2,6-diamine
Type:
Small organic molecule
Emp. Form.:
C16H23N3S
Mol. Mass.:
289.439
SMILES:
CCCN(CCC)C1Cc2cc3nc(N)sc3cc2C1
: