Target
Androgen receptor
Ligand
BDBM50094569
Substrate
Meas. Tech.
ChEMBL_52404 (CHEMBL665907)
IC50
18000±n/a nM
Citation
 Burden, PMAi, THLin, HQAkinci, MCostandi, MHambley, TMJohnston, GA Chiral derivatives of 2-cyclohexylideneperhydro-4,7-methanoindenes, a novel class of nonsteroidal androgen receptor ligand: synthesis, X-ray analysis, and biological activity. J Med Chem 43:4629-35 (2001)  
Target
Name:
Androgen receptor
Synonyms:
ANDR_RAT Ar Nr3c4 | androgen
Type:
Enzyme
Mol. Mass.:
98219.08
Organism:
Rattus norvegicus (Rat)
Description:
P15207
Residue:
902
  
Inhibitor
Name:
BDBM50094569
Synonyms:
6-chloro-3,20-dioxo-1beta,2beta-dihydro-3'H-cyclopropa[1,2]pregna-4,6-dien-17-yl acetate Cyproterone 17-O-acetate cyproterone acetate
Type:
Small organic molecule
Emp. Form.:
C24H29ClO4
Mol. Mass.:
416.938
SMILES:
CC(=O)O[C@@]1(CC[C@H]2[C@@H]3C=C(Cl)C4=CC(=O)[C@@H]5C[C@@H]5[C@]4(C)[C@H]3CC[C@]12C)C(C)=O
: