Target
Glyceraldehyde-3-phosphate dehydrogenase, cytosolic
Ligand
BDBM50100483
Substrate
Meas. Tech.
ChEMBL_72768 (CHEMBL680373)
IC50
2000±n/a nM
Citation
 Bressi, JCVerlinde, CLAronov, AMShaw, MLShin, SSNguyen, LNSuresh, SBuckner, FSVan Voorhis, WCKuntz, IDHol, WGGelb, MH Adenosine analogues as selective inhibitors of glyceraldehyde-3-phosphate dehydrogenase of Trypanosomatidae via structure-based drug design. J Med Chem 44:2080-93 (2001)  
Target
Name:
Glyceraldehyde-3-phosphate dehydrogenase, cytosolic
Synonyms:
G3PC_LEIME GAPDH Glyceraldehyde-3-phosphate dehydrogenase, cytosolic
Type:
PROTEIN
Mol. Mass.:
35645.40
Organism:
Leishmania mexicana
Description:
ChEMBL_72768
Residue:
331
  
Inhibitor
Name:
BDBM50100483
Synonyms:
CHEMBL63338 | N-(4-Hydroxy-5-hydroxymethyl-2-{6-[(naphthalen-2-ylmethyl)-amino]-purin-9-ylmethyl}-tetrahydro-furan-3-yl)-3,5-dimethoxy-benzamide
Type:
Small organic molecule
Emp. Form.:
C31H32N6O6
Mol. Mass.:
584.6224
SMILES:
COc1cc(OC)cc(c1)C(=O)N[C@@H]1C(Cn2cnc3c(NCc4ccc5ccccc5c4)ncnc23)OC(CO)[C@@H]1O
: