Target
cGMP-dependent 3',5'-cyclic phosphodiesterase
Ligand
BDBM50100656
Substrate
Meas. Tech.
ChEMBL_154420 (CHEMBL758019)
IC50
>10000±n/a nM
Citation
 Ukita, TNakamura, YKubo, AYamamoto, YMoritani, YSaruta, KHigashijima, TKotera, JTakagi, MKikkawa, KOmori, K Novel, potent, and selective phosphodiesterase 5 inhibitors: synthesis and biological activities of a series of 4-aryl-1-isoquinolinone derivatives. J Med Chem 44:2204-18 (2001)  
Target
Name:
cGMP-dependent 3',5'-cyclic phosphodiesterase
Synonyms:
PDE2A Phosphodiesterase 2A
Type:
PROTEIN
Mol. Mass.:
103200.18
Organism:
Bos taurus
Description:
ChEMBL_154420
Residue:
921
  
Inhibitor
Name:
BDBM50100656
Synonyms:
2-(4-Amino-phenyl)-7-benzyloxy-1-oxo-4-(3,4,5-trimethoxy-phenyl)-1,2-dihydro-isoquinoline-3-carboxylic acid methyl ester; hydrochloride | CHEMBL540539
Type:
Small organic molecule
Emp. Form.:
C33H30N2O7
Mol. Mass.:
566.6005
SMILES:
COC(=O)c1c(-c2cc(OC)c(OC)c(OC)c2)c2ccc(OCc3ccccc3)cc2c(=O)n1-c1ccc(N)cc1
: