Target
Glycogen phosphorylase, brain form
Ligand
BDBM50102880
Substrate
Meas. Tech.
ChEMBL_138356 (CHEMBL749044)
Ki
4200±n/a nM
Citation
 Somsák, LKovács, LTóth, MOsz, ESzilágyi, LGyörgydeák, ZDinya, ZDocsa, TTóth, BGergely, P Synthesis of and a comparative study on the inhibition of muscle and liver glycogen phosphorylases by epimeric pairs of d-gluco- and d-xylopyranosylidene-spiro-(thio)hydantoins and N-(d-glucopyranosyl) amides. J Med Chem 44:2843-8 (2001)  
Target
Name:
Glycogen phosphorylase, brain form
Synonyms:
Brain glycogen phosphorylase PYGB | PYGB_HUMAN
Type:
PROTEIN
Mol. Mass.:
96699.35
Organism:
Homo sapiens (Human)
Description:
ChEMBL_70998
Residue:
843
  
Inhibitor
Name:
BDBM50102880
Synonyms:
8,9,10-Trihydroxy-7-hydroxymethyl-6-oxa-1,3-diaza-spiro[4.5]decane-2,4-dione | CHEMBL97548
Type:
Small organic molecule
Emp. Form.:
C8H12N2O7
Mol. Mass.:
248.1901
SMILES:
OCC1O[C@@]2(NC(=O)NC2=O)C(O)[C@@H](O)[C@@H]1O
: