Target
Mu-type opioid receptor
Ligand
BDBM50026752
Substrate
Meas. Tech.
ChEMBL_149489 (CHEMBL757060)
IC50
315±n/a nM
Citation
 Poulain, RHorvath, DBonnet, BEckhoff, CChapelain, BBodinier, MCDéprez, B From hit to lead. Combining two complementary methods for focused library design. Application to mu opiate ligands. J Med Chem 44:3378-90 (2001)  
Target
Name:
Mu-type opioid receptor
Synonyms:
M-OR-1 MOR-1 MUOR1 Mu opiate receptor OPRM1 hMOP | mu-type opioid receptor isoform MOR-1
Type:
G Protein-Coupled Receptor (GPCR)
Mol. Mass.:
44789.51
Organism:
Homo sapiens (Human)
Description:
P35372
Residue:
400
  
Inhibitor
Name:
BDBM50026752
Synonyms:
1-Methyl-4-phenyl-piperidine-4-carboxylic acid ethyl ester 4-Ethoxycarbonyl-1-methyl-4-phenyl-piperidinium Demerol MEPERIDINE HYDROCHLORIDE Pethidine | ethyl 1-methyl-4-phenylpiperidine-4-carboxylate
Type:
Small organic molecule
Emp. Form.:
C15H21NO2
Mol. Mass.:
247.3327
SMILES:
CCOC(=O)C1(CCN(C)CC1)c1ccccc1
: