Target
Adenosine transporter 1
Ligand
BDBM50105121
Substrate
Meas. Tech.
ChEMBL_149711 (CHEMBL755808)
Ki
750±n/a nM
Citation
 Klenke, BStewart, MBarrett, MPBrun, RGilbert, IH Synthesis and biological evaluation of s-triazine substituted polyamines as potential new anti-trypanosomal drugs. J Med Chem 44:3440-52 (2001)  
Target
Name:
Adenosine transporter 1
Synonyms:
Type:
PROTEIN
Mol. Mass.:
51044.02
Organism:
Trypanosoma brucei
Description:
ChEMBL_31141
Residue:
463
  
Inhibitor
Name:
BDBM50105121
Synonyms:
CHEMBL542204 | N2-(3-((9-((3-((4-Amino-6-(methylamino)-1,3,5-triazin-2-yl)amino)propyl)amino)nonyl)amino)-propyl)N4-methyl-1,3,5-triazine-4,2,6-triamine Tetrahydrochloride
Type:
Small organic molecule
Emp. Form.:
C23H46N14
Mol. Mass.:
518.7051
SMILES:
CNc1nc(N)nc(NCCCNCCCCCCCCCNCCCNc2nc(N)nc(NC)n2)n1
: