Target
Adenosine transporter 1
Ligand
BDBM50105123
Substrate
Meas. Tech.
ChEMBL_149711 (CHEMBL755808)
Ki
240±n/a nM
Citation
 Klenke, BStewart, MBarrett, MPBrun, RGilbert, IH Synthesis and biological evaluation of s-triazine substituted polyamines as potential new anti-trypanosomal drugs. J Med Chem 44:3440-52 (2001)  
Target
Name:
Adenosine transporter 1
Synonyms:
Type:
PROTEIN
Mol. Mass.:
51044.02
Organism:
Trypanosoma brucei
Description:
ChEMBL_31141
Residue:
463
  
Inhibitor
Name:
BDBM50105123
Synonyms:
CHEMBL544581 | N2-(3-((12-((3-((4Amino,6-(dimethylamino)-1,3,5-triazin-2-yl)amino)propyl)amino)dodecyl)amino)-propyl)N4-methyl-1,3,5-triazine-4,2,6-triamine pentaahydrochloride
Type:
Small organic molecule
Emp. Form.:
C28H56N14
Mol. Mass.:
588.838
SMILES:
CN(C)c1nc(N)nc(NCCCNCCCCCCCCCCCCNCCCNc2nc(N)nc(n2)N(C)C)n1
: