Target
Gonadotropin-releasing hormone receptor
Ligand
BDBM50102454
Substrate
Meas. Tech.
ChEMBL_71451 (CHEMBL684350)
IC50
3.6±n/a nM
Citation
 Jiang, GStalewski, JGalyean, RDykert, JSchteingart, CBroqua, PAebi, AAubert, MLSemple, GRobson, PAkinsanya, KHaigh, RRiviere, PTrojnar, JJunien, JLRivier, JE GnRH antagonists: a new generation of long acting analogues incorporating p-ureido-phenylalanines at positions 5 and 6. J Med Chem 44:453-67 (2001)  
Target
Name:
Gonadotropin-releasing hormone receptor
Synonyms:
GNRHR GRHR GnRH-R Gonadotropin-releasing hormone receptor | Gonadotropin-releasing hormone receptor (GnRH)
Type:
Enzyme
Mol. Mass.:
37749.45
Organism:
Homo sapiens (Human)
Description:
P30968
Residue:
328
  
Inhibitor
Name:
BDBM50102454
Synonyms:
Ac-D-Nal-[D-(pCl)Phe]-D-Pal-Ser-Tyr-D-Har(Et2)-Leu-Har(Et2)-Pro-DAla-NH2 GANIRELIX ACETATE Ganirelix acetate injection | RS-26306
Type:
Small organic molecule
Emp. Form.:
C80H113ClN18O13
Mol. Mass.:
1570.319
SMILES:
CCNC(NCCCC[C@@H](NC(=O)[C@H](Cc1ccc(O)cc1)NC(=O)[C@H](CO)NC(=O)[C@@H](Cc1cccnc1)NC(=O)[C@@H](Cc1ccc(Cl)cc1)NC(=O)[C@@H](Cc1ccc2ccccc2c1)NC(C)=O)C(=O)N[C@@H](CC(C)C)C(=O)N[C@@H](CCCCNC(NCC)=NCC)C(=O)N1CCC[C@H]1C(=O)N[C@H](C)C(N)=O)=NCC
: