Target
Chymotrypsinogen A
Ligand
BDBM50098856
Substrate
Meas. Tech.
ChEMBL_49621 (CHEMBL660459)
Ki
48±n/a nM
Citation
 Akahoshi, FAshimori, ASakashita, HYoshimura, TImada, TNakajima, MMitsutomi, NKuwahara, SOhtsuka, TFukaya, CMiyazaki, MNakamura, N Synthesis, structure-activity relationships, and pharmacokinetic profiles of nonpeptidic alpha-keto heterocycles as novel inhibitors of human chymase. J Med Chem 44:1286-96 (2001)  
Target
Name:
Chymotrypsinogen A
Synonyms:
Alpha-chymotrypsin Chymotrypsin A Chymotrypsin A chain B Chymotrypsinogen A | alpha-Chymotrypsin (α-Chymotrypsin)
Type:
Serine protease
Mol. Mass.:
25670.88
Organism:
Bos taurus (bovine)
Description:
Residue:
245
  
Inhibitor
Name:
BDBM50098856
Synonyms:
2-[5-Amino-2-(4-fluoro-phenyl)-6-oxo-6H-pyrimidin-1-yl]-N-[1-benzyl-2-(5-methoxy-benzooxazol-2-yl)-2-oxo-ethyl]-acetamide | CHEMBL24281
Type:
Small organic molecule
Emp. Form.:
C29H24FN5O5
Mol. Mass.:
541.5298
SMILES:
COc1ccc2oc(nc2c1)C(=O)C(Cc1ccccc1)NC(=O)Cn1c(ncc(N)c1=O)-c1ccc(F)cc1
: