Target
Chymotrypsinogen A
Ligand
BDBM50098839
Substrate
Meas. Tech.
ChEMBL_49621 (CHEMBL660459)
Ki
45.10±n/a nM
Citation
 Akahoshi, FAshimori, ASakashita, HYoshimura, TImada, TNakajima, MMitsutomi, NKuwahara, SOhtsuka, TFukaya, CMiyazaki, MNakamura, N Synthesis, structure-activity relationships, and pharmacokinetic profiles of nonpeptidic alpha-keto heterocycles as novel inhibitors of human chymase. J Med Chem 44:1286-96 (2001)  
Target
Name:
Chymotrypsinogen A
Synonyms:
Alpha-chymotrypsin Chymotrypsin A Chymotrypsin A chain B Chymotrypsinogen A | alpha-Chymotrypsin (α-Chymotrypsin)
Type:
Serine protease
Mol. Mass.:
25670.88
Organism:
Bos taurus (bovine)
Description:
Residue:
245
  
Inhibitor
Name:
BDBM50098839
Synonyms:
2-{2-[2-(5-Amino-6-oxo-2-pyridin-3-yl-6H-pyrimidin-1-yl)-acetylamino]-3-phenyl-propionyl}-benzooxazole-5-carboxylic acid methyl ester | CHEMBL24647
Type:
Small organic molecule
Emp. Form.:
C29H24N6O6
Mol. Mass.:
552.5375
SMILES:
COC(=O)c1ccc2oc(nc2c1)C(=O)C(Cc1ccccc1)NC(=O)Cn1c(ncc(N)c1=O)-c1cccnc1
: