Target
P2Y purinoceptor 1
Ligand
BDBM50422385
Substrate
Meas. Tech.
ChEMBL_147577 (CHEMBL750155)
EC50
770±n/a nM
Citation
 Ravi, RGKim, HSServos, JZimmermann, HLee, KMaddileti, SBoyer, JLHarden, TKJacobson, KA Adenine nucleotide analogues locked in a Northern methanocarba conformation: enhanced stability and potency as P2Y(1) receptor agonists. J Med Chem 45:2090-100 (2002)  
Target
Name:
P2Y purinoceptor 1
Synonyms:
ATP receptor P2RY1_HUMAN P2Y1 Purinergic receptor P2Y1
Type:
Enzyme
Mol. Mass.:
42090.25
Organism:
Homo sapiens (Human)
Description:
P47900
Residue:
373
  
Inhibitor
Name:
BDBM50422385
Synonyms:
2-Chloro-Adenosinetriphosphate | CHEMBL1368696
Type:
Small organic molecule
Emp. Form.:
C10H15ClN5O13P3
Mol. Mass.:
541.626
SMILES:
Nc1nc(Cl)nc2n(cnc12)[C@@H]1O[C@H](COP(O)(=O)OP(O)(=O)OP(O)(O)=O)[C@@H](O)[C@H]1O
: