Target
D(2) dopamine receptor
Ligand
BDBM50123626
Substrate
Meas. Tech.
ChEMBL_60235 (CHEMBL671417)
Ki
0.06±n/a nM
Citation
 Dijkstra, DRodenhuis, NVermeulen, ESPugsley, TAWise, LDWikström, HV Further characterization of structural requirements for ligands at the dopamine D(2) and D(3) receptor: exploring the thiophene moiety. J Med Chem 45:3022-31 (2002)  
Target
Name:
D(2) dopamine receptor
Synonyms:
D(2) dopamine receptor DOPAMINE D2 Long DRD2 Dopamine D2 receptor Dopamine D2 receptor (D2R) Dopamine2-like | d2
Type:
Cell-surface receptors
Mol. Mass.:
50647.10
Organism:
Homo sapiens (Human)
Description:
P14416
Residue:
443
  
Inhibitor
Name:
BDBM50123626
Synonyms:
(S)-6-[Propyl-(2-thiophen-2-yl-ethyl)-amino]-5,6,7,8-tetrahydro-naphthalen-1-ol Neupro | ROTIGOTINE
Type:
Small organic molecule
Emp. Form.:
C19H25NOS
Mol. Mass.:
315.473
SMILES:
CCCN(CCc1cccs1)[C@H]1CCc2c(O)cccc2C1
: