Target
D(3) dopamine receptor
Ligand
BDBM50123626
Substrate
Meas. Tech.
ChEMBL_62294 (CHEMBL872893)
Ki
4±n/a nM
Citation
 Dijkstra, DRodenhuis, NVermeulen, ESPugsley, TAWise, LDWikström, HV Further characterization of structural requirements for ligands at the dopamine D(2) and D(3) receptor: exploring the thiophene moiety. J Med Chem 45:3022-31 (2002)  
Target
Name:
D(3) dopamine receptor
Synonyms:
DOPAMINE D3 DRD3_HUMAN Dopamine D3 receptor (D3) Dopamine receptor Dopamine receptor D3
Type:
Mol. Mass.:
44243.43
Organism:
Homo sapiens (Human)
Description:
Residue:
400
  
Inhibitor
Name:
BDBM50123626
Synonyms:
(S)-6-[Propyl-(2-thiophen-2-yl-ethyl)-amino]-5,6,7,8-tetrahydro-naphthalen-1-ol Neupro | ROTIGOTINE
Type:
Small organic molecule
Emp. Form.:
C19H25NOS
Mol. Mass.:
315.473
SMILES:
CCCN(CCc1cccs1)[C@H]1CCc2c(O)cccc2C1
: