Target
Chymotrypsinogen A
Ligand
BDBM50118029
Substrate
Meas. Tech.
ChEMBL_49927 (CHEMBL664296)
IC50
22.0±n/a nM
Citation
 Macdonald, SJDowle, MDHarrison, LAClarke, GDInglis, GGJohnson, MRShah, PSmith, RAAmour, AFleetwood, GHumphreys, DCMolloy, CRDixon, MGodward, REWonacott, AJSingh, OMHodgson, STHardy, GW Discovery of further pyrrolidine trans-lactams as inhibitors of human neutrophil elastase (HNE) with potential as development candidates and the crystal structure of HNE complexed with an inhibitor (GW475151). J Med Chem 45:3878-90 (2002)  
Target
Name:
Chymotrypsinogen A
Synonyms:
Alpha-chymotrypsin Chymotrypsin A Chymotrypsin A chain B Chymotrypsinogen A | alpha-Chymotrypsin (α-Chymotrypsin)
Type:
Serine protease
Mol. Mass.:
25670.88
Organism:
Bos taurus (bovine)
Description:
Residue:
245
  
Inhibitor
Name:
BDBM50118029
Synonyms:
3-Isopropyl-1-methanesulfonyl-4-(4-piperidin-1-yl-but-2-enoyl)-hexahydro-pyrrolo[3,2-b]pyrrol-2-one; hydrochloride | CHEMBL2368616
Type:
Small organic molecule
Emp. Form.:
C19H32ClN3O4S
Mol. Mass.:
433.993
SMILES:
Cl.[H][C@@]12CCN(C(=O)\C=C\CN3CCCCC3)[C@@]1([H])[C@H](C(C)C)C(=O)N2S(C)(=O)=O
: