Target
P2X purinoceptor 5
Ligand
BDBM50366480
Substrate
Meas. Tech.
ChEMBL_147417 (CHEMBL750991)
EC50
1000±n/a nM
Citation
 Jacobson, KAJarvis, MFWilliams, M Purine and pyrimidine (P2) receptors as drug targets. J Med Chem 45:4057-93 (2002)  
Target
Name:
P2X purinoceptor 5
Synonyms:
ATP receptor P2X5 Purinergic receptor
Type:
PROTEIN
Mol. Mass.:
51486.52
Organism:
Rattus norvegicus
Description:
ChEMBL_147417
Residue:
455
  
Inhibitor
Name:
BDBM50366480
Synonyms:
ADENOSINE TRIPHOSPHATE | ATP
Type:
Small organic molecule
Emp. Form.:
C10H16N5O13P3
Mol. Mass.:
507.181
SMILES:
Nc1ncnc2n(cnc12)[C@@H]1O[C@H](CO[P@](O)(=O)O[P@@](O)(=O)OP(O)(O)=O)[C@@H](O)[C@H]1O
: