Target
P2X purinoceptor 2
Ligand
BDBM50366480
Substrate
Meas. Tech.
ChEMBL_149743 (CHEMBL760168)
EC50
1400±n/a nM
Citation
 Jacobson, KAJarvis, MFWilliams, M Purine and pyrimidine (P2) receptors as drug targets. J Med Chem 45:4057-93 (2002)  
Target
Name:
P2X purinoceptor 2
Synonyms:
ATP receptor P2X purinoceptor 2 P2X2/P2X3 receptor Purinergic receptor | Purinergic, P2X2
Type:
Enzyme Catalytic Domain
Mol. Mass.:
52625.55
Organism:
RAT
Description:
Purinergic, P2X2 0 RAT::P49653
Residue:
472
  
Inhibitor
Name:
BDBM50366480
Synonyms:
ADENOSINE TRIPHOSPHATE | ATP
Type:
Small organic molecule
Emp. Form.:
C10H16N5O13P3
Mol. Mass.:
507.181
SMILES:
Nc1ncnc2n(cnc12)[C@@H]1O[C@H](CO[P@](O)(=O)O[P@@](O)(=O)OP(O)(O)=O)[C@@H](O)[C@H]1O
: