Target
P2X purinoceptor 1
Ligand
BDBM50370142
Substrate
Meas. Tech.
ChEMBL_149728 (CHEMBL759511)
EC50
2000±n/a nM
Citation
 Jacobson, KAJarvis, MFWilliams, M Purine and pyrimidine (P2) receptors as drug targets. J Med Chem 45:4057-93 (2002)  
Target
Name:
P2X purinoceptor 1
Synonyms:
ATP receptor P2RX1_HUMAN Purinergic receptor | Purinergic, P2X
Type:
Enzyme Catalytic Domain
Mol. Mass.:
44992.65
Organism:
Homo sapiens (Human)
Description:
Purinergic, P2X 0 HUMAN::P51575
Residue:
399
  
Inhibitor
Name:
BDBM50370142
Synonyms:
CHEMBL133463
Type:
Small organic molecule
Emp. Form.:
C11H18N5O12P3
Mol. Mass.:
505.2082
SMILES:
Nc1ncnc2n(cnc12)[C@@H]1O[C@H](CO[P@](O)(=O)O[P@](O)(=O)CP(O)(O)=O)[C@@H](O)[C@H]1O
: