Target
Angiotensin-converting enzyme
Ligand
BDBM50011367
Substrate
Meas. Tech.
ChEMBL_36754 (CHEMBL883277)
IC50
23±n/a nM
Citation
 Patchett, AA 2002 Alfred Burger Award Address in Medicinal Chemistry. Natural products and design: interrelated approaches in drug discovery. J Med Chem 45:5609-16 (2002)  
Target
Name:
Angiotensin-converting enzyme
Synonyms:
ACE Angiotensin converting enzyme (ACE) Angiotensin-converting enzyme, soluble form CD_antigen=CD143 DCP1 Kininase II
Type:
Enzyme
Mol. Mass.:
149709.01
Organism:
Homo sapiens (Human)
Description:
Residue:
1306
  
Inhibitor
Name:
BDBM50011367
Synonyms:
1-(3-Mercapto-2-methyl-propionyl)-pyrrolidine-2-carboxylic acid CHEMBL162360
Type:
Small organic molecule
Emp. Form.:
C9H15NO3S
Mol. Mass.:
217.285
SMILES:
C[C@H](CS)C(=O)N1CCCC1C(O)=O
: