Target
Angiotensin-converting enzyme
Ligand
BDBM50121930
Substrate
Meas. Tech.
ChEMBL_36754 (CHEMBL883277)
IC50
0.60±n/a nM
Citation
 Patchett, AA 2002 Alfred Burger Award Address in Medicinal Chemistry. Natural products and design: interrelated approaches in drug discovery. J Med Chem 45:5609-16 (2002)  
Target
Name:
Angiotensin-converting enzyme
Synonyms:
ACE Angiotensin converting enzyme (ACE) Angiotensin-converting enzyme, soluble form CD_antigen=CD143 DCP1 Kininase II
Type:
Enzyme
Mol. Mass.:
149709.01
Organism:
Homo sapiens (Human)
Description:
Residue:
1306
  
Inhibitor
Name:
BDBM50121930
Synonyms:
6-(1-Carboxy-3-phenyl-propylamino)-5-oxo-octahydro-thiazolo[3,2-a]azepine-3-carboxylic acid | CHEMBL347755
Type:
Small organic molecule
Emp. Form.:
C19H24N2O5S
Mol. Mass.:
392.469
SMILES:
OC(=O)C(CCc1ccccc1)N[C@H]1CCC[C@H]2SC[C@H](N2C1=O)C(O)=O
: