Target
Acetylcholinesterase
Ligand
BDBM50313079
Substrate
Meas. Tech.
ChEMBL_27954 (CHEMBL649134)
Ki
19700±n/a nM
Citation
 Leader, HWolfe, ADChiang, PKGordon, RK Pyridophens: binary pyridostigmine-aprophen prodrugs with differential inhibition of acetylcholinesterase, butyrylcholinesterase, and muscarinic receptors. J Med Chem 45:902-10 (2002)  
Target
Name:
Acetylcholinesterase
Synonyms:
ACES_BOVIN Acetylcholinesterase (AChE) | Acetylcholinesterase precursor
Type:
Enzyme
Mol. Mass.:
67659.62
Organism:
Bos taurus (bovine)
Description:
Residue:
613
  
Inhibitor
Name:
BDBM50313079
Synonyms:
3-Dimethylcarbamoyloxy-1-methyl-pyridinium; bromide Mestinon Pyridostigmine Regonol
Type:
Small organic molecule
Emp. Form.:
C9H13N2O2
Mol. Mass.:
181.2112
SMILES:
CN(C)C(=O)Oc1ccc[n+](C)c1
: