Target
Beta-galactosidase
Ligand
BDBM50111607
Substrate
Meas. Tech.
ChEMBL_37409 (CHEMBL651841)
IC50
15000±n/a nM
Citation
 McGovern, SLCaselli, EGrigorieff, NShoichet, BK A common mechanism underlying promiscuous inhibitors from virtual and high-throughput screening. J Med Chem 45:1712-22 (2002)  
Target
Name:
Beta-galactosidase
Synonyms:
Acid beta-galactosidase ELNR1 GLB1 | Lactase
Type:
PROTEIN
Mol. Mass.:
76074.43
Organism:
Homo sapiens (Human)
Description:
ChEMBL_215886
Residue:
677
  
Inhibitor
Name:
BDBM50111607
Synonyms:
3,4-Dichloro-N-[5-(5-chloro-benzothiazol-2-ylsulfanyl)-[1,3,4]thiadiazol-2-yl]-benzamide | CHEMBL49869
Type:
Small organic molecule
Emp. Form.:
C16H7Cl3N4OS3
Mol. Mass.:
473.807
SMILES:
Clc1ccc2sc(Sc3nnc(NC(=O)c4ccc(Cl)c(Cl)c4)s3)nc2c1
: