Target
2-5A-dependent ribonuclease
Ligand
BDBM50370228
Substrate
Meas. Tech.
ChEMBL_195099 (CHEMBL800846)
IC50
>100000±n/a nM
Citation
 Sawai, HHirano, AMori, HShinozuka, KDong, BSilverman, RH Synthesis, characterization, and biological properties of 8-azido- and 8-amino-substituted 2',5'-oligoadenylates. J Med Chem 46:4926-32 (2003)  
Target
Name:
2-5A-dependent ribonuclease
Synonyms:
2-5A-dependent RNase RN5A_MOUSE Ribonuclease 4 Rnasel | Rns4
Type:
PROTEIN
Mol. Mass.:
83274.00
Organism:
Mus musculus
Description:
ChEMBL_195099
Residue:
735
  
Inhibitor
Name:
BDBM50370228
Synonyms:
CHEMBL607882
Type:
Small organic molecule
Emp. Form.:
C20H23N16O10P
Mol. Mass.:
678.4716
SMILES:
Nc1ncnc2n(C3O[C@H](COP(O)(=O)O[C@@H]4[C@H](O)[C@@H](CO)OC4n4c(N=[N+]=[N-])nc5c(N)ncnc45)[C@@H](O)[C@H]3O)c(N=[N+]=[N-])nc12
: