Target
2-5A-dependent ribonuclease
Ligand
BDBM50421415
Substrate
Meas. Tech.
ChEMBL_195099 (CHEMBL800846)
IC50
4.0±n/a nM
Citation
 Sawai, HHirano, AMori, HShinozuka, KDong, BSilverman, RH Synthesis, characterization, and biological properties of 8-azido- and 8-amino-substituted 2',5'-oligoadenylates. J Med Chem 46:4926-32 (2003)  
Target
Name:
2-5A-dependent ribonuclease
Synonyms:
2-5A-dependent RNase RN5A_MOUSE Ribonuclease 4 Rnasel | Rns4
Type:
PROTEIN
Mol. Mass.:
83274.00
Organism:
Mus musculus
Description:
ChEMBL_195099
Residue:
735
  
Inhibitor
Name:
BDBM50421415
Synonyms:
CHEMBL414948
Type:
Small organic molecule
Emp. Form.:
C30H38N15O19P3
Mol. Mass.:
1005.6331
SMILES:
Nc1ncnc2n(cnc12)[C@@H]1O[C@H](CO[P@](O)(=O)O[C@@H]2[C@H](O)[C@@H](CO[P@](O)(=O)O[C@@H]3[C@H](O)[C@@H](COP(O)(O)=O)O[C@H]3n3cnc4c(N)ncnc34)O[C@H]2n2cnc3c(N)ncnc23)[C@@H](O)[C@H]1O
: