Target
5-hydroxytryptamine receptor 5A
Ligand
BDBM50130271
Substrate
Meas. Tech.
ChEMBL_3591 (CHEMBL618077)
Ki
63±n/a nM
Citation
 Glennon, RA Higher-end serotonin receptors: 5-HT(5), 5-HT(6), and 5-HT(7). J Med Chem 46:2795-812 (2003)  
Target
Name:
5-hydroxytryptamine receptor 5A
Synonyms:
5-HT-5 5-HT5 5-hydroxytryptamine receptor 5A 5ht5a Serotonin 5a (5-HT5a) receptor | Serotonin receptor 5A
Type:
Enzyme Catalytic Domain
Mol. Mass.:
40749.33
Organism:
MOUSE
Description:
5-HT5 0 MOUSE::P30966
Residue:
357
  
Inhibitor
Name:
BDBM50130271
Synonyms:
7-Methyl-4,6,6a,7,8,9-hexahydro-indolo[4,3-fg]quinoline-9-carboxylic acid (2-hydroxymethyl-2-methyl-butyl)-amide | CHEMBL97518
Type:
Small organic molecule
Emp. Form.:
C22H29N3O2
Mol. Mass.:
367.4846
SMILES:
CC[C@@](C)(CO)CNC(=O)[C@H]1CN(C)[C@@H]2Cc3c[nH]c4cccc(C2=C1)c34
: