Target
Alpha-1B adrenergic receptor
Ligand
BDBM50007568
Substrate
Meas. Tech.
ChEMBL_34197 (CHEMBL649214)
Ki
0.22±n/a nM
Citation
 Balle, TPerregaard, JRamirez, MTLarsen, AKSøby, KKLiljefors, TAndersen, K Synthesis and structure-affinity relationship investigations of 5-heteroaryl-substituted analogues of the antipsychotic sertindole. A new class of highly selective alpha(1) adrenoceptor antagonists. J Med Chem 46:265-83 (2003)  
Target
Name:
Alpha-1B adrenergic receptor
Synonyms:
ADA1B_MESAU Adrenergic receptor alpha adrenergic Alpha1B
Type:
Enzyme Catalytic Domain
Mol. Mass.:
56514.13
Organism:
C.H.O.
Description:
adrenergic Alpha1B ADRA1B C.H.O.::P18841
Residue:
515
  
Inhibitor
Name:
BDBM50007568
Synonyms:
1-((S)-8-Chloro-10,11-dihydro-dibenzo[b,f]thiepin-10-yl)-4-methyl-piperazine CHEMBL303313 | OCTOCLOTHEPIN-S
Type:
Small organic molecule
Emp. Form.:
C19H21ClN2S
Mol. Mass.:
344.901
SMILES:
CN1CCN(CC1)[C@H]1Cc2ccccc2Sc2ccc(Cl)cc12
: