Target
Beta-lactamase
Ligand
BDBM31774
Substrate
Meas. Tech.
ChEMBL_40567 (CHEMBL651415)
IC50
20000±n/a nM
Citation
 Seidler, JMcGovern, SLDoman, TNShoichet, BK Identification and prediction of promiscuous aggregating inhibitors among known drugs. J Med Chem 46:4477-86 (2003)  
Target
Name:
Beta-lactamase
Synonyms:
AMPC_ECOLI Beta-lactamase (AmpC) Cephalosporinase ampA | ampC
Type:
Protien
Mol. Mass.:
41561.62
Organism:
Escherichia coli
Description:
P00811
Residue:
377
  
Inhibitor
Name:
BDBM31774
Synonyms:
CHEMBL104 Clotrimazole Mycelex cid_2812
Type:
Small organic molecule
Emp. Form.:
C22H17ClN2
Mol. Mass.:
344.837
SMILES:
Clc1ccccc1C(c1ccccc1)(c1ccccc1)n1ccnc1
: