Target
Androgen receptor
Ligand
BDBM50056900
Substrate
Meas. Tech.
ChEMBL_36123 (CHEMBL647749)
IC50
>1000±n/a nM
Citation
 Cogan, PSKoch, TH Rational design and synthesis of androgen receptor-targeted nonsteroidal anti-androgen ligands for the tumor-specific delivery of a doxorubicin-formaldehyde conjugate. J Med Chem 46:5258-70 (2003)  
Target
Name:
Androgen receptor
Synonyms:
ANDR_HUMAN Androgen Receptor Androgen receptor/Baculoviral IAP repeat-containing protein 2 Dihydrotestosterone receptor Nuclear receptor subfamily 3 group C member 4
Type:
Receptor
Mol. Mass.:
99185.27
Organism:
Homo sapiens (Human)
Description:
CHO cells were stably transfected with human AR gene.
Residue:
920
  
Inhibitor
Name:
BDBM50056900
Synonyms:
2-Carbamoylphenol 2-Hydroxybenzamide OHB o-Hydroxybenzamide
Type:
Small organic molecule
Emp. Form.:
C7H7NO2
Mol. Mass.:
137.136
SMILES:
NC(=O)c1ccccc1O
: