Target
5-hydroxytryptamine receptor 3A/3B
Ligand
BDBM50123802
Substrate
Meas. Tech.
ChEMBL_3167 (CHEMBL617812)
IC50
1.3±n/a nM
Citation
 Hirokawa, YFujiwara, ISuzuki, KHarada, HYoshikawa, TYoshida, NKato, S Synthesis and structure-affinity relationships of novel N-(1-ethyl-4-methylhexahydro-1,4-diazepin-6-yl)pyridine-3-carboxamides with potent serotonin 5-HT3 and dopamine D2 receptor antagonistic activity. J Med Chem 46:702-15 (2003)  
Target
Name:
5-hydroxytryptamine receptor 3A/3B
Synonyms:
Serotonin 3 (5-HT3) receptor | Serotonin 3a (5-HT3a)/3b (5-HT3b) receptor
Type:
Mol. Mass.:
Description:
ASSAY_ID of EBI is 2974
Components:
This complex has 2 components.
Component 1
Name:
5-hydroxytryptamine receptor 3B
Synonyms:
5HT3B_RAT Serotonin (5-HT) receptor
Type:
PROTEIN
Mol. Mass.:
50328.78
Organism:
Rattus norvegicus
Description:
EBI_11885
Residue:
437
  
Component 2
Name:
5-hydroxytryptamine receptor 3A
Synonyms:
5-HT3 5HT3A_RAT Htr3 Serotonin (5-HT) receptor | Zacopride site-R
Type:
Enzyme Catalytic Domain
Mol. Mass.:
55428.70
Organism:
RAT
Description:
5-HT3 HTR3A RAT::P35563
Residue:
483
  
Inhibitor
Name:
BDBM50123802
Synonyms:
5-Chloro-N-(1,4-dimethyl-[1,4]diazepan-6-yl)-2-methoxy-6-methylamino-nicotinamide | CHEMBL349595
Type:
Small organic molecule
Emp. Form.:
C15H24ClN5O2
Mol. Mass.:
341.836
SMILES:
CNc1nc(OC)c(cc1Cl)C(=O)NC1CN(C)CCN(C)C1
: