Target
Cytochrome P450 3A4
Ligand
BDBM50012278
Substrate
Meas. Tech.
ChEMBL_52069 (CHEMBL664809)
IC50
26000±n/a nM
Citation
 Schwab, DFischer, HTabatabaei, APoli, SHuwyler, J Comparison of in vitro P-glycoprotein screening assays: recommendations for their use in drug discovery. J Med Chem 46:1716-25 (2003)  
Target
Name:
Cytochrome P450 3A4
Synonyms:
Albendazole monooxygenase CP3A4_HUMAN CYP3A4 CYPIIIA4 Cytochrome P450 3A4 (CYP3A4) Nifedipine oxidase Taurochenodeoxycholate 6-alpha-hydroxylase
Type:
Enzyme
Mol. Mass.:
57349.57
Organism:
Homo sapiens (Human)
Description:
Residue:
503
  
Inhibitor
Name:
BDBM50012278
Synonyms:
(2ALPHA,2''BETA,3BETA,4ALPHA,5BETA)-VINCALEUKOBLASTINE VINBLASTINE cid_5388983
Type:
Small organic molecule
Emp. Form.:
C46H58N4O9
Mol. Mass.:
810.9741
SMILES:
CC[C@]1(O)C[C@@H]2CN(C1)CCc1c([nH]c3ccccc13)[C@@](C2)(C(=O)OC)c1cc2c(cc1OC)N(C)[C@@H]1[C@]22CCN3CC=C[C@](CC)([C@@H]23)[C@@H](OC(C)=O)[C@]1(O)C(=O)OC
: