Target
ATP-dependent translocase ABCB1
Ligand
BDBM22893
Substrate
Meas. Tech.
ChEMBL_148002 (CHEMBL754160)
IC50
>50000±n/a nM
Citation
 Schwab, DFischer, HTabatabaei, APoli, SHuwyler, J Comparison of in vitro P-glycoprotein screening assays: recommendations for their use in drug discovery. J Med Chem 46:1716-25 (2003)  
Target
Name:
ATP-dependent translocase ABCB1
Synonyms:
ABCB1 MDR1_HUMAN Multidrug resistance protein 1 P-glycoprotein (P-gp) PGY1
Type:
Protein
Mol. Mass.:
141503.50
Organism:
Homo sapiens (Human)
Description:
P08183
Residue:
1280
  
Inhibitor
Name:
BDBM22893
Synonyms:
CHEMBL512 ZANTAC | dimethyl[(5-{[(2-{[(E)-1-(methylamino)-2-nitroethenyl]amino}ethyl)sulfanyl]methyl}furan-2-yl)methyl]amine
Type:
Small organic molecule
Emp. Form.:
C13H22N4O3S
Mol. Mass.:
314.404
SMILES:
CN\C([CH-][N+]([O-])=O)=[NH+]/CCSCc1ccc(CN(C)C)o1
: