Target
E3 ubiquitin-protein ligase XIAP
Ligand
BDBM13158
Substrate
Meas. Tech.
ChEMBL_38679 (CHEMBL650033)
IC50
4100±n/a nM
Citation
 Nikolovska-Coleska, ZXu, LHu, ZTomita, YLi, PRoller, PPWang, RFang, XGuo, RZhang, MLippman, MEYang, DWang, S Discovery of embelin as a cell-permeable, small-molecular weight inhibitor of XIAP through structure-based computational screening of a traditional herbal medicine three-dimensional structure database. J Med Chem 47:2430-40 (2004)  
Target
Name:
E3 ubiquitin-protein ligase XIAP
Synonyms:
API3 E3 ubiquitin-protein ligase XIAP Inhibitor of apoptosis protein 3 X-linked inhibitor of apoptosis XIAP | XIAP_HUMAN
Type:
Protein
Mol. Mass.:
56685.27
Organism:
Homo sapiens (Human)
Description:
P98170
Residue:
497
  
Inhibitor
Name:
BDBM13158
Synonyms:
2,5-dihydroxy-3-undecylcyclohexa-2,5-diene-1,4-dione | Embelin
Type:
Small organic molecule
Emp. Form.:
C17H26O4
Mol. Mass.:
294.3859
SMILES:
CCCCCCCCCC=Cc1c(O)c(O)cc(O)c1O
: